BDBM50249769 CHEMBL4748345
SMILES Cn1c2ccc(cc2ccc1=O)S(=O)(=O)Nc1ccccc1
InChI Key InChIKey=MOKVWBKNSWFEEO-UHFFFAOYSA-N
Data  2 IC50
PDB links: 1 PDB ID matches this monomer.
  Tab Delimited (TSV)   2D SDfile   Computed 3D by Vconf -m prep SDfile
Find this compound or compounds like it in BindingDB:
Activity Spreadsheet -- Enzyme Inhibition Constant Data from BindingDB
Found 2 hits for monomerid = 50249769
LigandPNGBDBM50249769(CHEMBL4748345)
Affinity DataIC50:  23nM. Assay description: Inhibition of BRD9 (unknown origin) incubated in dark for 30 mins by TR-FRET assay
In DepthDetails ArticlePubMed
TargetDual specificity protein kinase CLK1(Mus musculus)
Universit£
Curated by ChEMBL
LigandPNGBDBM50249769(CHEMBL4748345)
Affinity DataIC50:  290nM. Assay description: Inhibition of BRD9 (unknown origin) incubated in dark for 30 mins by TR-FRET assay