BDBM50249987 CHEMBL4082888
SMILES Cc1n(nc2c1c(C)nn(CCCN1CCC(CC1)N1C(Nc3ccccc3C1=O)c1ccccc1F)c2=O)-c1ccc(C)cc1
InChI Key InChIKey=OXOLNDYXTYKMCE-UHFFFAOYSA-N
Data  1 Kd
  Tab Delimited (TSV)   2D SDfile   Computed 3D by Vconf -m prep SDfile
Find this compound or compounds like it in BindingDB:
Activity Spreadsheet -- Enzyme Inhibition Constant Data from BindingDB
Found 1 hit for monomerid = 50249987
TargetRetinal rod rhodopsin-sensitive cGMP 3',5'-cyclic phosphodiesterase subunit delta(Homo sapiens (Human))
Second Military Medical University
Curated by ChEMBL
LigandPNGBDBM50249987(CHEMBL4082888)
Affinity DataKd:  4nM. Assay description: Inhibition of Atrovastatin-PEG3-FITC binding to PDEdelta (unknown origin) incubated for 60 mins by fluorescence anisotropy assay
In DepthDetails ArticlePubMed