BDBM50250652 CHEMBL4101800::US10961200, Compound 42::US11247971, Cmpd ID 42
SMILES NS(=O)(=O)c1ccc(Cc2c(nn(-c3nc(cs3)C(O)=O)c2C(F)(F)F)-c2cccc(c2)-c2ccccc2)cc1
InChI Key InChIKey=CLDNGVXOQQESLI-UHFFFAOYSA-N
Data  8 IC50  1 EC50
  Tab Delimited (TSV)   2D SDfile   Computed 3D by Vconf -m prep SDfile
Find this compound or compounds like it in BindingDB:
Activity Spreadsheet -- Enzyme Inhibition Constant Data from BindingDB
Found 9 hits for monomerid = 50250652
TargetL-lactate dehydrogenase B chain(Homo sapiens (Human))
National Center For Advancing Translational Sciences
Curated by ChEMBL
LigandPNGBDBM50250652(CHEMBL4101800 | US10961200, Compound 42 | US112479...)
Affinity DataIC50:  62nM. Assay description: Inhibition of human erythrocytes LDHB using sodium pyruvate as substrate after 5 mins in presence of NAPDH by diaphorase/resazurin based fluorescence...
In DepthDetails ArticlePubMed
TargetL-lactate dehydrogenase A chain(Homo sapiens (Human))
National Center For Advancing Translational Sciences
Curated by ChEMBL
LigandPNGBDBM50250652(CHEMBL4101800 | US10961200, Compound 42 | US112479...)
Affinity DataIC50:  53nM. Assay description: Inhibition of human liver LDHA using sodium pyruvate as substrate after 5 mins in presence of NAPDH and EDTA by diaphorase/resazurin based fluorescen...
In DepthDetails ArticlePubMed
TargetIsocitrate dehydrogenase [NADP] cytoplasmic(Homo sapiens (Human))
National Center For Advancing Translational Sciences
Curated by ChEMBL
LigandPNGBDBM50250652(CHEMBL4101800 | US10961200, Compound 42 | US112479...)
Affinity DataIC50:  3.35E+4nM. Assay description: Inhibition of wild type IDH1 (unknown origin) using isocitrate as substrate preincubated for 30 mins followed by substrate addition in presence of NA...
In DepthDetails ArticlePubMed
TargetL-lactate dehydrogenase A chain(Homo sapiens (Human))
National Center For Advancing Translational Sciences
Curated by ChEMBL
LigandPNGBDBM50250652(CHEMBL4101800 | US10961200, Compound 42 | US112479...)
Affinity DataIC50:  4.35E+3nM. Assay description: Inhibition of human liver LDHA using sodium pyruvate as substrate after 5 mins in presence of NAPDH and in absence of EDTA by diaphorase/resazurin ba...
In DepthDetails ArticlePubMed
TargetL-lactate dehydrogenase A chain(Homo sapiens (Human))
National Center For Advancing Translational Sciences
Curated by ChEMBL
LigandPNGBDBM50250652(CHEMBL4101800 | US10961200, Compound 42 | US112479...)
Affinity DataIC50: <100nM. Assay description: Test compounds were placed in a Greiner Bio-One (Monroe, N.C.) 1536-well black solid bottom assay plate. 200 millimolar (mM) Tris HCl, pH 7.4, 100 mi...
In DepthDetails US Patent
TargetL-lactate dehydrogenase A chain(Homo sapiens (Human))
National Center For Advancing Translational Sciences
Curated by ChEMBL
LigandPNGBDBM50250652(CHEMBL4101800 | US10961200, Compound 42 | US112479...)
Affinity DataIC50:  53nM. Assay description: Inhibition of human liver LDHA using sodium pyruvate as substrate after 5 mins in presence of NAPDH and EDTA by diaphorase/resazurin based fluorescen...
In DepthDetails ArticlePubMed
TargetL-lactate dehydrogenase A chain(Homo sapiens (Human))
National Center For Advancing Translational Sciences
Curated by ChEMBL
LigandPNGBDBM50250652(CHEMBL4101800 | US10961200, Compound 42 | US112479...)
Affinity DataEC50: >1.00E+5nM. Assay description: Inhibition of human liver LDHA using sodium pyruvate as substrate after 5 mins in presence of NAPDH and EDTA by diaphorase/resazurin based fluorescen...
In DepthDetails ArticlePubMed
TargetL-lactate dehydrogenase A chain(Homo sapiens (Human))
National Center For Advancing Translational Sciences
Curated by ChEMBL
LigandPNGBDBM50250652(CHEMBL4101800 | US10961200, Compound 42 | US112479...)
Affinity DataIC50: <100nM. Assay description: Test compounds were placed in a Greiner Bio-One (Monroe, N.C.) 1536-well black solid bottom assay plate. 200 millimolar (mM) Tris HCl, pH 7.4, 100 mi...
In DepthDetails US Patent
TargetL-lactate dehydrogenase A chain(Homo sapiens (Human))
National Center For Advancing Translational Sciences
Curated by ChEMBL
LigandPNGBDBM50250652(CHEMBL4101800 | US10961200, Compound 42 | US112479...)
Affinity DataIC50:  4.80E+3nM. Assay description: Inhibition of human LDHA using sodium pyruvate as substrate in presence of NAPDH
In DepthDetails ArticlePubMed