BDBM50253880 2-(4-chloro-6-(quinolin-6-yloxy)pyrimidin-2-ylthio)octanoic acid::CHEMBL459932
SMILES CCCCCCC(Sc1nc(Cl)cc(Oc2ccc3ncccc3c2)n1)C(O)=O
InChI Key InChIKey=UBZJCDDNXHNSNF-UHFFFAOYSA-N
Data  2 IC50
  Tab Delimited (TSV)   2D SDfile   Computed 3D by Vconf -m prep SDfile
Find this compound or compounds like it in BindingDB:
Activity Spreadsheet -- Enzyme Inhibition Constant Data from BindingDB
Found 2 hits for monomerid = 50253880
TargetProstaglandin G/H synthase 2(Homo sapiens (Human))
Eberhard Karls University Tuebingen
Curated by ChEMBL
LigandPNGBDBM50253880(2-(4-chloro-6-(quinolin-6-yloxy)pyrimidin-2-ylthio...)
Affinity DataIC50: >10nM. Assay description: Inhibition of human recombinant COX2
In DepthDetails ArticlePubMed
TargetProstaglandin G/H synthase 1(Ovis aries (Sheep))
Eberhard Karls University Tuebingen
Curated by ChEMBL
LigandPNGBDBM50253880(2-(4-chloro-6-(quinolin-6-yloxy)pyrimidin-2-ylthio...)
Affinity DataIC50: >10nM. Assay description: Inhibition of ovine COX1
In DepthDetails ArticlePubMed