BDBM50254180 CHEMBL3558806
SMILES CC(=C)CNC(=N)NCCCCCCN1CCCCCCCCNC(=N)NC1=O
InChI Key InChIKey=SVXUBIJUBAIEGF-UHFFFAOYSA-N
Data  1 KI  1 IC50
  Tab Delimited (TSV)   2D SDfile   Computed 3D by Vconf -m prep SDfile
Find this compound or compounds like it in BindingDB:
Activity Spreadsheet -- Enzyme Inhibition Constant Data from BindingDB
Found 2 hits for monomerid = 50254180
TargetChitinase(Hypocrea rufa)
University Of Siena
Curated by ChEMBL
LigandPNGBDBM50254180(CHEMBL3558806)
Affinity DataKi:  3.48E+4nM. Assay description: Inhibition of Trichoderma viride chitinase incubated for 10 mins to 3 hrs using 4-nitrophenyl N-acetyl-beta-D-glucosaminide substrate by spectrophoto...
In DepthDetails ArticlePubMed
TargetChitinase(Hypocrea rufa)
University Of Siena
Curated by ChEMBL
LigandPNGBDBM50254180(CHEMBL3558806)
Affinity DataIC50:  1.08E+5nM. Assay description: Inhibition of Trichoderma viride chitinase incubated for 10 mins to 3 hrs using 4-nitrophenyl N-acetyl-beta-D-glucosaminide substrate by spectrophoto...
In DepthDetails ArticlePubMed