BDBM50254316 CHEMBL467705::cid_6472157::methyl 3-(2,4-dichlorophenyl)-1H-pyrazole-5-carboxylate
SMILES COC(=O)c1cc(n[nH]1)-c1ccc(Cl)cc1Cl
InChI Key InChIKey=KHJJAYIZQBZPRW-UHFFFAOYSA-N
Data  5 IC50
  Tab Delimited (TSV)   2D SDfile   Computed 3D by Vconf -m prep SDfile
Find this compound or compounds like it in BindingDB:
Activity Spreadsheet -- Enzyme Inhibition Constant Data from BindingDB
Found 5 hits for monomerid = 50254316
TargetAlkaline phosphatase, germ cell type(Homo sapiens (Human))
Sanford-Burnham Center For Chemical Genomics
Curated by PubChem BioAssay
LigandPNGBDBM50254316(CHEMBL467705 | cid_6472157 | methyl 3-(2,4-dichlor...)
Affinity DataIC50: >1.00E+5nM. Assay description: Data Source: Sanford-Burnham Center for Chemical Genomics (SBCCG) Source Affiliation: Sanford-Burnham Medical Research Institute (SBMRI, San Diego, C...
In DepthDetails PCBioAssay
TargetAlkaline phosphatase, tissue-nonspecific isozyme(Homo sapiens (Human))
Burnham Center For Chemical Genomics
Curated by PubChem BioAssay
LigandPNGBDBM50254316(CHEMBL467705 | cid_6472157 | methyl 3-(2,4-dichlor...)
Affinity DataIC50:  315nM. Assay description: Sanford-Burnham Center for Chemical Genomics (SBCCG) Sanford-Burnham Medical Research Institute (SBMRI, San Diego, CA) NIH Molecular Libraries Screen...
In DepthDetails PCBioAssay
TargetAlkaline phosphatase, tissue-nonspecific isozyme(Homo sapiens (Human))
Burnham Center For Chemical Genomics
Curated by PubChem BioAssay
LigandPNGBDBM50254316(CHEMBL467705 | cid_6472157 | methyl 3-(2,4-dichlor...)
Affinity DataIC50:  500nM. Assay description: Inhibition of TNSALP (unknown origin)
In DepthDetails ArticlePubMed
TargetAlkaline phosphatase, germ cell type(Homo sapiens (Human))
Sanford-Burnham Center For Chemical Genomics
Curated by PubChem BioAssay
LigandPNGBDBM50254316(CHEMBL467705 | cid_6472157 | methyl 3-(2,4-dichlor...)
Affinity DataIC50: >1.00E+5nM. Assay description: Data Source: Sanford-Burnham Center for Chemical Genomics (SBCCG) Source Affiliation: Sanford-Burnham Medical Research Institute (SBMRI, San Diego, C...
In DepthDetails PCBioAssay
TargetAlkaline phosphatase, tissue-nonspecific isozyme(Homo sapiens (Human))
Burnham Center For Chemical Genomics
Curated by PubChem BioAssay
LigandPNGBDBM50254316(CHEMBL467705 | cid_6472157 | methyl 3-(2,4-dichlor...)
Affinity DataIC50:  264nM. Assay description: Sanford-Burnham Center for Chemical Genomics (SBCCG) Sanford-Burnham Medical Research Institute (SBMRI, San Diego, CA) NIH Molecular Libraries Screen...
In DepthDetails PCBioAssay