BDBM50257130 (S)-2-(2-(5-methoxy-2-methyl-1H-indol-3-yl)acetamido)-N-(4-phenylthiazol-2-yl)-6-(sulfamoylamino)hexanamide::CHEMBL494124
SMILES COc1ccc2[nH]c(C)c(CC(=O)N[C@@H](CCCCNS(N)(=O)=O)C(=O)Nc3nc(cs3)-c3ccccc3)c2c1
InChI Key InChIKey=UMWRGESNBMPCQC-QHCPKHFHSA-N
Data  2 IC50
  Tab Delimited (TSV)   2D SDfile   Computed 3D by Vconf -m prep SDfile
Find this compound or compounds like it in BindingDB:
Activity Spreadsheet -- Enzyme Inhibition Constant Data from BindingDB
Found 2 hits for monomerid = 50257130
TargetHistone deacetylase 6(Homo sapiens (Human))
Methylgene
Curated by ChEMBL
LigandPNGBDBM50257130((S)-2-(2-(5-methoxy-2-methyl-1H-indol-3-yl)acetami...)
Affinity DataIC50:  1.20E+3nM. Assay description: Inhibition of human recombinant His-tagged HDAC6 expressed in baculovirus
In DepthDetails ArticlePubMed
TargetHistone deacetylase 1(Homo sapiens (Human))
Methylgene
Curated by ChEMBL
LigandPNGBDBM50257130((S)-2-(2-(5-methoxy-2-methyl-1H-indol-3-yl)acetami...)
Affinity DataIC50:  64nM. Assay description: Inhibition of human recombinant FLAG-tagged HDAC1 expressed in baculovirus
In DepthDetails ArticlePubMed