BDBM50257132 (S)-benzyl 1-(2-phenylthiazol-4-yl)-5-(sulfamoylamino)pentylcarbamate::CHEMBL492312
SMILES NS(=O)(=O)NCCCC[C@H](NC(=O)OCc1ccccc1)c1csc(n1)-c1ccccc1
InChI Key InChIKey=KYMADELXCHTVCR-IBGZPJMESA-N
Data  2 IC50
  Tab Delimited (TSV)   2D SDfile   Computed 3D by Vconf -m prep SDfile
Find this compound or compounds like it in BindingDB:
Activity Spreadsheet -- Enzyme Inhibition Constant Data from BindingDB
Found 2 hits for monomerid = 50257132
TargetHistone deacetylase 6(Homo sapiens (Human))
Methylgene
Curated by ChEMBL
LigandPNGBDBM50257132((S)-benzyl 1-(2-phenylthiazol-4-yl)-5-(sulfamoylam...)
Affinity DataIC50:  400nM. Assay description: Inhibition of human recombinant His-tagged HDAC6 expressed in baculovirus
In DepthDetails ArticlePubMed
TargetHistone deacetylase 1(Homo sapiens (Human))
Methylgene
Curated by ChEMBL
LigandPNGBDBM50257132((S)-benzyl 1-(2-phenylthiazol-4-yl)-5-(sulfamoylam...)
Affinity DataIC50:  790nM. Assay description: Inhibition of human recombinant FLAG-tagged HDAC1 expressed in baculovirus
In DepthDetails ArticlePubMed