BDBM50257321 CHEMBL4062016
SMILES Cn1c(ccc1-c1ccc(O)c(Cl)c1)C#N
InChI Key InChIKey=YYASZIWLXAUYKK-UHFFFAOYSA-N
Data  1 IC50  2 EC50
  Tab Delimited (TSV)   2D SDfile   Computed 3D by Vconf -m prep SDfile
Find this compound or compounds like it in BindingDB:
Activity Spreadsheet -- Enzyme Inhibition Constant Data from BindingDB
Found 3 hits for monomerid = 50257321
TargetAndrogen receptor(Homo sapiens (Human))
Pfizer
Curated by ChEMBL
LigandPNGBDBM50257321(CHEMBL4062016)
Affinity DataEC50: >1.00E+4nM. Assay description: Androgenic activity at human androgen receptor expressed in African green monkey CV-1 cells assessed as increase in interaction between VP16-fused AR...
In DepthDetails ArticlePubMed
TargetAndrogen receptor(Homo sapiens (Human))
Pfizer
Curated by ChEMBL
LigandPNGBDBM50257321(CHEMBL4062016)
Affinity DataIC50:  48nM. Assay description: Androgenic activity at human androgen receptor expressed in African green monkey CV-1 cells assessed as increase in interaction between VP16-fused AR...
In DepthDetails ArticlePubMed
TargetAndrogen receptor(Homo sapiens (Human))
Pfizer
Curated by ChEMBL
LigandPNGBDBM50257321(CHEMBL4062016)
Affinity DataEC50:  910nM. Assay description: Androgenic activity at human androgen receptor expressed in African green monkey CV-1 cells assessed as increase in interaction between VP16-fused AR...
In DepthDetails ArticlePubMed