BDBM50257397 CHEMBL510383::trans-[2-(3-Hydroxyphenyl)cyclopropyl]methylamine Hydrochloride
SMILES NC[C@H]1C[C@@H]1c1cccc(O)c1
InChI Key InChIKey=NZTVPKOZOOULAP-PSASIEDQSA-N
Data  3 EC50
  Tab Delimited (TSV)   2D SDfile   Computed 3D by Vconf -m prep SDfile
Find this compound or compounds like it in BindingDB:
Activity Spreadsheet -- Enzyme Inhibition Constant Data from BindingDB
Found 3 hits for monomerid = 50257397
Target5-hydroxytryptamine receptor 2C(Homo sapiens (Human))
University Of Illinois At Chicago
Curated by ChEMBL
LigandPNGBDBM50257397(CHEMBL510383 | trans-[2-(3-Hydroxyphenyl)cycloprop...)
Affinity DataEC50:  3.30nM. Assay description: Agonist activity at human 5HT2C receptor expressed in HEK293 cells assessed as calcium flux by FLIPR assay
In DepthDetails ArticlePubMed
Target5-hydroxytryptamine receptor 2B(Homo sapiens (Human))
University Of Illinois At Chicago
Curated by ChEMBL
LigandPNGBDBM50257397(CHEMBL510383 | trans-[2-(3-Hydroxyphenyl)cycloprop...)
Affinity DataEC50:  5.5nM. Assay description: Agonist activity at human 5HT2B receptor expressed in HEK293 cells assessed as calcium flux by FLIPR assay
In DepthDetails ArticlePubMed
Target5-hydroxytryptamine receptor 2A(Homo sapiens (Human))
University Of Illinois At Chicago
Curated by ChEMBL
LigandPNGBDBM50257397(CHEMBL510383 | trans-[2-(3-Hydroxyphenyl)cycloprop...)
Affinity DataEC50:  247nM. Assay description: Agonist activity at human 5HT2A receptor expressed in HEK293 cells assessed as calcium flux by FLIPR assay
In DepthDetails ArticlePubMed