BDBM50259303 CHEMBL4092103
SMILES O=C(Nc1nccn2cc(nc12)-c1ccccc1)c1ccccc1
InChI Key InChIKey=ZBZLIMXLZLGHSQ-UHFFFAOYSA-N
Data  1 KI  2 IC50
  Tab Delimited (TSV)   2D SDfile   Computed 3D by Vconf -m prep SDfile
Find this compound or compounds like it in BindingDB:
Activity Spreadsheet -- Enzyme Inhibition Constant Data from BindingDB
Found 3 hits for monomerid = 50259303
TargetTransmembrane domain-containing protein TMIGD3(Homo sapiens (Human))
Universita Degli Studi Di Firenze
Curated by ChEMBL
LigandPNGBDBM50259303(CHEMBL4092103)
Affinity DataKi:  52nM. Assay description: Displacement of [125I]AB-MECA from human adenosine A3 receptor expressed in CHO cell membranes after 120 mins by scintillation counting method
In DepthDetails ArticlePubMed
TargetAdenosine receptor A3(Homo sapiens (Human))
Isf College Of Pharmacy
Curated by ChEMBL
LigandPNGBDBM50259303(CHEMBL4092103)
Affinity DataIC50:  163nM. Assay description: Binding affinity to human adenosine A3A receptor
In DepthDetails PubMed
TargetTransmembrane domain-containing protein TMIGD3(Homo sapiens (Human))
Universita Degli Studi Di Firenze
Curated by ChEMBL
LigandPNGBDBM50259303(CHEMBL4092103)
Affinity DataIC50:  163nM. Assay description: Antagonist activity at human A3 receptor expressed in CHO cells assessed as inhibition of CI-IB-MECA-mediated inhibition of cAMP production by [3H]cA...
In DepthDetails ArticlePubMed