BDBM50261587 CHEMBL4104395
SMILES Cc1[nH]nc(O)c1C(c1c(O)n[nH]c1C)c1ccc(OCc2ccncc2)cc1
InChI Key InChIKey=HSQRCMCFCODCBI-UHFFFAOYSA-N
Data  2 IC50
  Tab Delimited (TSV)   2D SDfile   Computed 3D by Vconf -m prep SDfile
Find this compound or compounds like it in BindingDB:
Activity Spreadsheet -- Enzyme Inhibition Constant Data from BindingDB
Found 2 hits for monomerid = 50261587
Target25-hydroxyvitamin D-1 alpha hydroxylase, mitochondrial(Homo sapiens (Human))
Cardiff University
Curated by ChEMBL
LigandPNGBDBM50261587(CHEMBL4104395)
Affinity DataIC50:  570nM. Assay description: Inhibition of human CYP27B1 expressed in Escherichia coli assessed as reduction in hydrolase activity incubated for 25 mins using Adx, AdR and 1,25(O...
In DepthDetails ArticlePubMed
Target1,25-dihydroxyvitamin D(3) 24-hydroxylase, mitochondrial(Homo sapiens (Human))
Cardiff University
Curated by ChEMBL
LigandPNGBDBM50261587(CHEMBL4104395)
Affinity DataIC50:  2.50E+3nM. Assay description: Inhibition of N-terminal MBP-tagged human CYP24A1 expressed in Escherichia coli assessed as reduction in hydrolase activity incubated for 25 mins usi...
In DepthDetails ArticlePubMed