BDBM50263596 (E)-3-(4-(3-(methylamino)phenylthio)-2,3-bis(trifluoromethyl)phenyl)-1-morpholinoprop-2-en-1-one::CHEMBL479061
SMILES CNc1cccc(Sc2ccc(\C=C\C(=O)N3CCOCC3)c(c2C(F)(F)F)C(F)(F)F)c1
InChI Key InChIKey=BWZVEDBBEOJBAG-SOFGYWHQSA-N
Data  1 IC50
  Tab Delimited (TSV)   2D SDfile   Computed 3D by Vconf -m prep SDfile
Find this compound or compounds like it in BindingDB:
Activity Spreadsheet -- Enzyme Inhibition Constant Data from BindingDB
Found 1 hit for monomerid = 50263596
TargetIntegrin alpha-L(Homo sapiens (Human))
Biogen Idec
Curated by ChEMBL
LigandPNGBDBM50263596((E)-3-(4-(3-(methylamino)phenylthio)-2,3-bis(trifl...)
Affinity DataIC50:  4.40nM. Assay description: Inhibition of recombinant LFA1/ICAM1-IG interaction (unknown origin) by time-resolved fluorimetry method
In DepthDetails ArticlePubMed