BDBM50264245 CHEMBL4103745
SMILES COC(=O)[C@H](CCC(=O)NO)NC(=O)CCCCC(=O)Nc1ccccc1
InChI Key InChIKey=YZOHUYCCKLNIMN-AWEZNQCLSA-N
Data  1 IC50
  Tab Delimited (TSV)   2D SDfile   Computed 3D by Vconf -m prep SDfile
Find this compound or compounds like it in BindingDB:
Activity Spreadsheet -- Enzyme Inhibition Constant Data from BindingDB
Found 1 hit for monomerid = 50264245
TargetEctonucleotide pyrophosphatase/phosphodiesterase family member 2(Mus musculus)
National And Kapodistrian University Of Athens
Curated by ChEMBL
LigandPNGBDBM50264245(CHEMBL4103745)
Affinity DataIC50:  400nM. Assay description: Inhibition of mouse ATX-beta using LPC 16:0 as substrate by Amplex Red PLD assay
In DepthDetails ArticlePubMed