BDBM50264246 CHEMBL4083902
SMILES COC(=O)[C@H](CCC(=O)NO)NC(=O)CCCCC(=O)Nc1ccc(F)cc1
InChI Key InChIKey=UURJPQISXXDHPI-AWEZNQCLSA-N
Data  1 IC50
  Tab Delimited (TSV)   2D SDfile   Computed 3D by Vconf -m prep SDfile
Find this compound or compounds like it in BindingDB:
Activity Spreadsheet -- Enzyme Inhibition Constant Data from BindingDB
Found 1 hit for monomerid = 50264246
TargetEctonucleotide pyrophosphatase/phosphodiesterase family member 2(Mus musculus)
National And Kapodistrian University Of Athens
Curated by ChEMBL
LigandPNGBDBM50264246(CHEMBL4083902)
Affinity DataIC50: >5.00E+3nM. Assay description: Inhibition of mouse ATX-beta using LPC 16:0 as substrate by Amplex Red PLD assay
In DepthDetails ArticlePubMed