BDBM50264420 CHEMBL4100384
SMILES O=C(NCCc1cccs1)c1cnc2c(SSc3cccc4cc(cnc34)C(=O)NCCc3cccs3)cccc2c1
InChI Key InChIKey=ZXYPACVVZOCLGB-UHFFFAOYSA-N
Data  4 IC50
  Tab Delimited (TSV)   2D SDfile   Computed 3D by Vconf -m prep SDfile
Find this compound or compounds like it in BindingDB:
Activity Spreadsheet -- Enzyme Inhibition Constant Data from BindingDB
Found 4 hits for monomerid = 50264420
Target26S proteasome non-ATPase regulatory subunit 14(Homo sapiens (Human))
University Of California San Diego
Curated by ChEMBL
LigandPNGBDBM50264420(CHEMBL4100384)
Affinity DataIC50:  300nM. Assay description: Inhibition of 26S proteasome regulatory subunit RPN11 deubiquitinating activity in human erythrocytes using Ub4-pepOG protein substrate preincubated ...
In DepthDetails ArticlePubMed
Target26S proteasome non-ATPase regulatory subunit 14(Homo sapiens (Human))
University Of California San Diego
Curated by ChEMBL
LigandPNGBDBM50264420(CHEMBL4100384)
Affinity DataIC50:  5.00E+3nM. Assay description: Inhibition of 26S proteasome regulatory subunit RPN11 deubiquitinating activity in beta5 inhibitor MG132 pretreated human HeLa cells expressing UbG76...
In DepthDetails ArticlePubMed
TargetCOP9 signalosome complex subunit 5(Homo sapiens (Human))
University Of California San Diego
Curated by ChEMBL
LigandPNGBDBM50264420(CHEMBL4100384)
Affinity DataIC50:  4.00E+3nM. Assay description: Inhibition of CSN5 (unknown origin) using SCFskp2-Nedd8OG as substrate after 1 hr by fluorescence polarization assay
In DepthDetails ArticlePubMed
TargetSTAM-binding protein(Homo sapiens (Human))
University Of California San Diego
Curated by ChEMBL
LigandPNGBDBM50264420(CHEMBL4100384)
Affinity DataIC50:  1.30E+3nM. Assay description: Inhibition of AMSH (unknown origin) using DiUbK63TAMRA as substrate by fluorescence assay
In DepthDetails ArticlePubMed