BDBM50269102 CHEMBL4097473
SMILES Fc1ccc(cc1)C1=NN(C(C1)c1cccc(Cl)c1Cl)c1cccc(Cl)c1
InChI Key InChIKey=PKACGQSIJVNFML-UHFFFAOYSA-N
Data  1 IC50
  Tab Delimited (TSV)   2D SDfile   Computed 3D by Vconf -m prep SDfile
Find this compound or compounds like it in BindingDB:
Activity Spreadsheet -- Enzyme Inhibition Constant Data from BindingDB
Found 1 hit for monomerid = 50269102
TargetBasic phospholipase A2 VRV-PL-VIIIa(Daboia russelii)
University Of Mysore
Curated by ChEMBL
LigandPNGBDBM50269102(CHEMBL4097473)
Affinity DataIC50:  1.92E+4nM. Assay description: Inhibition of Vipera russelii venom sPLA2 using DMPC as substrate preincubated for 2 mins followed by substrate addition measured after 30 mins
In DepthDetails ArticlePubMed