BDBM50272420 (2R,3R,4S,5R,6S)-2-(hydroxymethyl)-6-((1-((2S,3S,4R,5S,6S)-3,4,5-trihydroxy-6-(hydroxymethyl)-tetrahydro-2H-pyran-2-yl)-1H-1,2,3-triazol-4-yl)methylthio)-tetrahydro-2H-pyran-3,4,5-triol::CHEMBL497324
SMILES OC[C@H]1O[C@@H](SCc2cn(nn2)[C@H]2O[C@@H](CO)[C@@H](O)[C@@H](O)[C@@H]2O)[C@H](O)[C@@H](O)[C@H]1O
InChI Key InChIKey=LFCUJSJBMGCTCP-IKQIEQASSA-N
Data  2 IC50
  Tab Delimited (TSV)   2D SDfile   Computed 3D by Vconf -m prep SDfile
Find this compound or compounds like it in BindingDB:
Activity Spreadsheet -- Enzyme Inhibition Constant Data from BindingDB
Found 2 hits for monomerid = 50272420
TargetGalectin-1(Homo sapiens (Human))
Universit£
Curated by ChEMBL
LigandPNGBDBM50272420((2R,3R,4S,5R,6S)-2-(hydroxymethyl)-6-((1-((2S,3S,4...)
Affinity DataIC50: >5.00E+6nM. Assay description: Inhibition of recombinant galectin 1 in human O type red blood cells by hemagglutination assay
In DepthDetails ArticlePubMed
TargetGalectin-3(Homo sapiens (Human))
Universit£
Curated by ChEMBL
LigandPNGBDBM50272420((2R,3R,4S,5R,6S)-2-(hydroxymethyl)-6-((1-((2S,3S,4...)
Affinity DataIC50:  2.50E+6nM. Assay description: Inhibition of recombinant galectin 3 in human O type red blood cells by hemagglutination assay
In DepthDetails ArticlePubMed