BDBM50273392 CHEMBL456998::N-(Naphthalen-2-yl)-2-(pyridin-2-yl)quinoline-4-carboxamide
SMILES O=C(Nc1ccc2ccccc2c1)c1cc(nc2ccccc12)-c1ccccn1
InChI Key InChIKey=VWERNWBTANWABF-UHFFFAOYSA-N
Data  1 KI
  Tab Delimited (TSV)   2D SDfile   Computed 3D by Vconf -m prep SDfile
Find this compound or compounds like it in BindingDB:
Activity Spreadsheet -- Enzyme Inhibition Constant Data from BindingDB
Found 1 hit for monomerid = 50273392
TargetCytochrome P450 2C9(Homo sapiens (Human))
Washington State University
Curated by ChEMBL
LigandPNGBDBM50273392(CHEMBL456998 | N-(Naphthalen-2-yl)-2-(pyridin-2-yl...)
Affinity DataKi:  1.07E+4nM. Assay description: Inhibition of reconstituted CYP2C9 (unknown origin)
In DepthDetails ArticlePubMed