BDBM50273447 6,8-Dimethyl-N-(naphthalen-2-yl)-2-(pyridin-4-yl)quinoline-4-carboxamide::CHEMBL464595
SMILES Cc1cc(C)c2nc(cc(C(=O)Nc3ccc4ccccc4c3)c2c1)-c1ccncc1
InChI Key InChIKey=YZXHBUHLBUXXLU-UHFFFAOYSA-N
Data  1 KI
  Tab Delimited (TSV)   2D SDfile   Computed 3D by Vconf -m prep SDfile
Find this compound or compounds like it in BindingDB:
Activity Spreadsheet -- Enzyme Inhibition Constant Data from BindingDB
Found 1 hit for monomerid = 50273447
TargetCytochrome P450 2C9(Homo sapiens (Human))
Washington State University
Curated by ChEMBL
LigandPNGBDBM50273447(6,8-Dimethyl-N-(naphthalen-2-yl)-2-(pyridin-4-yl)q...)
Affinity DataKi:  11nM. Assay description: Inhibition of reconstituted CYP2C9 (unknown origin)
In DepthDetails ArticlePubMed