BDBM50274689 CHEMBL4126050
SMILES C[C@@H](NC(=O)[C@@H](N)Cc1c(C)cc(O)cc1C)C(=O)N[C@@H](Cc1ccccc1)C(=O)NCC(O)=O
InChI Key InChIKey=CHOLZAWAZWSJAN-CZAAIQMYSA-N
Data  4 IC50  2 EC50
  Tab Delimited (TSV)   2D SDfile   Computed 3D by Vconf -m prep SDfile
Find this compound or compounds like it in BindingDB:
Activity Spreadsheet -- Enzyme Inhibition Constant Data from BindingDB
Found 6 hits for monomerid = 50274689
TargetDelta-type opioid receptor(MOUSE)
Vrije Universiteit Brussel
Curated by ChEMBL
LigandPNGBDBM50274689(CHEMBL4126050)
Affinity DataIC50:  23nM. Assay description: Displacement of [125I]-Deltorphin 2 from mouse Flag-tagged delta-opioid receptor expressed in HEK293 cell membranes after 60 mins by gamma counting
In DepthDetails ArticlePubMed
TargetDelta-type opioid receptor(Rattus norvegicus (rat))
Vrije Universiteit Brussel
Curated by ChEMBL
LigandPNGBDBM50274689(CHEMBL4126050)
Affinity DataEC50:  2.40nM. Assay description: Agonist activity at rat delta-opioid receptor expressed in HEK293 cells co-expressing Rluc2-EPAC-GFP10 biosenser assessed as inhibition of forskolin-...
In DepthDetails ArticlePubMed
TargetMu-type opioid receptor(Rattus norvegicus (rat))
Vrije Universiteit Brussel
Curated by ChEMBL
LigandPNGBDBM50274689(CHEMBL4126050)
Affinity DataEC50:  0.0120nM. Assay description: Agonist activity at rat mu-opioid receptor expressed in HEK293 cells co-expressing Rluc2-EPAC-GFP10 biosenser assessed as inhibition of forskolin-ind...
In DepthDetails ArticlePubMed
TargetMu-type opioid receptor(MOUSE)
Vrije Universiteit Brussel
Curated by ChEMBL
LigandPNGBDBM50274689(CHEMBL4126050)
Affinity DataIC50:  0.140nM. Assay description: Displacement of [125I]-DAMGO from mouse Flag-tagged mu-opioid receptor expressed in HEK293 cell membranes after 60 mins by gamma counting
In DepthDetails ArticlePubMed
TargetDelta-type opioid receptor(MOUSE)
Vrije Universiteit Brussel
Curated by ChEMBL
LigandPNGBDBM50274689(CHEMBL4126050)
Affinity DataIC50:  1.20nM. Assay description: Agonist activity at delta-opioid receptor in mouse vasa deferens assessed as inhibition of electrically induced contractions
In DepthDetails ArticlePubMed
TargetMu-type opioid receptor(GUINEA PIG)
Vrije Universiteit Brussel
Curated by ChEMBL
LigandPNGBDBM50274689(CHEMBL4126050)
Affinity DataIC50:  1.5nM. Assay description: Agonist activity at mu-opioid receptor in guinea pig ileum assessed as inhibition of electrically induced contractions
In DepthDetails ArticlePubMed