BDBM50274945 CHEMBL457720::trans-4-[4-(2-Chlorophenyl)cyclohexyl]-1-(2-pyridinyl)piperazine
SMILES Clc1ccccc1[C@H]1CC[C@@H](CC1)N1CCN(CC1)c1ccccn1
InChI Key InChIKey=QSUQNNQRYGZRHL-IYARVYRRSA-N
Data  2 KI
  Tab Delimited (TSV)   2D SDfile   Computed 3D by Vconf -m prep SDfile
Find this compound or compounds like it in BindingDB:
Activity Spreadsheet -- Enzyme Inhibition Constant Data from BindingDB
Found 2 hits for monomerid = 50274945
Target3-beta-hydroxysteroid-Delta(8),Delta(7)-isomerase(Cavia porcellus)
Universita Degli Studi Di Bari
Curated by ChEMBL
LigandPNGBDBM50274945(CHEMBL457720 | trans-4-[4-(2-Chlorophenyl)cyclohex...)
Affinity DataKi:  7.20nM. Assay description: Displacement of [3H](-)-(S)-emopamil from EBP in guinea pig liver membrane
In DepthDetails ArticlePubMed
TargetSigma non-opioid intracellular receptor 1(Cavia porcellus (Guinea pig))
Universita Degli Studi Di Bari
Curated by ChEMBL
LigandPNGBDBM50274945(CHEMBL457720 | trans-4-[4-(2-Chlorophenyl)cyclohex...)
Affinity DataKi:  190nM. Assay description: Displacement of [3H](+)-pentazocine from sigma 1 receptor in guinea pig brain membrane without cerebellum
In DepthDetails ArticlePubMed