BDBM50275803 CHEMBL469324::N-(2-(3,5-dimethyl-1H-pyrazol-1-yl)-6-(3-(1-methylpyrrolidin-3-yloxy)phenyl)pyrimidin-4-yl)acetamide
SMILES CN1CCC(C1)Oc1cccc(c1)-c1cc(NC(C)=O)nc(n1)-n1nc(C)cc1C
InChI Key InChIKey=KWXCLKIPZNZLAX-UHFFFAOYSA-N
Data  1 KI  1 IC50
  Tab Delimited (TSV)   2D SDfile   Computed 3D by Vconf -m prep SDfile
Find this compound or compounds like it in BindingDB:
Activity Spreadsheet -- Enzyme Inhibition Constant Data from BindingDB
Found 2 hits for monomerid = 50275803
TargetAdenosine receptor A2a(Homo sapiens (Human))
Neurocrine Biosciences
Curated by ChEMBL
LigandPNGBDBM50275803(CHEMBL469324 | N-(2-(3,5-dimethyl-1H-pyrazol-1-yl)...)
Affinity DataKi:  2nM. Assay description: Displacement of [3H]ZM241385 from human adenosine A2A receptor expressed in HEK293 cells
In DepthDetails ArticlePubMed
TargetAdenosine receptor A2a(Rattus norvegicus (rat))
Neurocrine Biosciences
Curated by ChEMBL
LigandPNGBDBM50275803(CHEMBL469324 | N-(2-(3,5-dimethyl-1H-pyrazol-1-yl)...)
Affinity DataIC50:  42nM. Assay description: Activity at adenosine A2A receptor in rat PC12 cells assessed as intracellular cAMP accumulation
In DepthDetails ArticlePubMed