BDBM50276484 1-(2,6-diisopropylphenyl)-3-((1-(2-methoxyphenyl)-4-(3-methoxyphenyl)piperidin-4-yl)methyl)urea::CHEMBL510453
SMILES COc1cccc(c1)C1(CNC(=O)Nc2c(cccc2C(C)C)C(C)C)CCN(CC1)c1ccccc1OC
InChI Key InChIKey=ISXLCONDKDAKDK-UHFFFAOYSA-N
Data  1 IC50
  Tab Delimited (TSV)   2D SDfile   Computed 3D by Vconf -m prep SDfile
Find this compound or compounds like it in BindingDB:
Activity Spreadsheet -- Enzyme Inhibition Constant Data from BindingDB
Found 1 hit for monomerid = 50276484
TargetSterol O-acyltransferase 1(Homo sapiens (Human))
Dainippon Sumitomo Pharma
Curated by ChEMBL
LigandPNGBDBM50276484(1-(2,6-diisopropylphenyl)-3-((1-(2-methoxyphenyl)-...)
Affinity DataIC50:  47nM. Assay description: Inhibition of ACAT in human HepG2 cells
In DepthDetails ArticlePubMed