BDBM50277729 (3R,4R)-2-ethyl-1-oxo-3-(4-phenoxyphenyl)-1,2,3,4-tetrahydroisoquinoline-4-carboxylic acid::CHEMBL484772
SMILES CCN1[C@H]([C@H](C(O)=O)c2ccccc2C1=O)c1ccc(Oc2ccccc2)cc1
InChI Key InChIKey=KDLAPHSXRALIBY-YADHBBJMSA-N
Data  1 IC50
  Tab Delimited (TSV)   2D SDfile   Computed 3D by Vconf -m prep SDfile
Find this compound or compounds like it in BindingDB:
Activity Spreadsheet -- Enzyme Inhibition Constant Data from BindingDB
Found 1 hit for monomerid = 50277729
TargetFree fatty acid receptor 1(Homo sapiens (Human))
Pfizer
Curated by ChEMBL
LigandPNGBDBM50277729((3R,4R)-2-ethyl-1-oxo-3-(4-phenoxyphenyl)-1,2,3,4-...)
Affinity DataIC50:  12nM. Assay description: Antagonist activity at human GPR40 expressed HEK293 cells assessed as effect on intracellular calcium concentration by FLIPR assay
In DepthDetails ArticlePubMed