BDBM50279601 CHEMBL4161551
SMILES COC(=O)c1ccc2\C(=C(\Nc3ccc4CCN(C(=O)Cn5cccn5)c4c3)c3ccccc3)C(=O)Nc2c1
InChI Key InChIKey=HEKLHRGCBLROOS-DQSJHHFOSA-N
Data  5 IC50
  Tab Delimited (TSV)   2D SDfile   Computed 3D by Vconf -m prep SDfile
Find this compound or compounds like it in BindingDB:
Activity Spreadsheet -- Enzyme Inhibition Constant Data from BindingDB
Found 5 hits for monomerid = 50279601
TargetFibroblast growth factor receptor 1(Homo sapiens (Human))
Shenyang Pharmaceutical University
Curated by ChEMBL
LigandPNGBDBM50279601(CHEMBL4161551)
Affinity DataIC50:  4.70E+3nM. Assay description: Inhibition of recombinant FGFR1 (unknown origin) by off-chip mobility shift assay
In DepthDetails ArticlePubMed
TargetPotassium voltage-gated channel subfamily H member 2(Homo sapiens (Human))
Shenyang Pharmaceutical University
Curated by ChEMBL
LigandPNGBDBM50279601(CHEMBL4161551)
Affinity DataIC50: >30nM. Assay description: Inhibition of human ERG
In DepthDetails ArticlePubMed
TargetPlatelet-derived growth factor receptor beta(Homo sapiens (Human))
Shenyang Pharmaceutical University
Curated by ChEMBL
LigandPNGBDBM50279601(CHEMBL4161551)
Affinity DataIC50:  24nM. Assay description: Inhibition constant against Bacillus subtilis azp-12 DNA topoisomerase III (mutant enzyme).
In DepthDetails ArticlePubMed
TargetVascular endothelial growth factor receptor 2(Homo sapiens (Human))
Shenyang Pharmaceutical University
Curated by ChEMBL
LigandPNGBDBM50279601(CHEMBL4161551)
Affinity DataIC50:  300nM. Assay description: Inhibition of recombinant VEGFR2 (unknown origin) by off-chip mobility shift assay
In DepthDetails ArticlePubMed
TargetPlatelet-derived growth factor receptor beta(Mus musculus (mouse))
Shenyang Pharmaceutical University
Curated by ChEMBL
LigandPNGBDBM50279601(CHEMBL4161551)
Affinity DataIC50:  110nM. Assay description: Inhibition of PDGFR in mouse NIH/3T3 cells assessed as reduction in recombinant human PDGF-BB-induced cell proliferation after 42 hrs by cell titer 9...
In DepthDetails ArticlePubMed