BDBM50279840 (D)-2,2-difluoro-2-deoxy-myo-inositol 1,4,5-triphosphate::(DL)-2,2-difluoro-2-deoxy-myo-inositol 1,4,5-triphosphate::(L)-2,2-difluoro-2-deoxy-myo-inositol 1,4,5-triphosphate::CHEMBL1161466
SMILES OC1C(OP([O-])([O-])=O)C(OP([O-])([O-])=O)C(O)C(F)(F)C1OP([O-])([O-])=O
InChI Key InChIKey=JEHSVQICCQDKLQ-UHFFFAOYSA-H
Data  1 KI  3 EC50
  Tab Delimited (TSV)   2D SDfile   Computed 3D by Vconf -m prep SDfile
Find this compound or compounds like it in BindingDB:
Activity Spreadsheet -- Enzyme Inhibition Constant Data from BindingDB
Found 4 hits for monomerid = 50279840
TargetInositol polyphosphate-5-phosphatase A(Homo sapiens (Human))
TBA
Curated by ChEMBL
LigandPNGBDBM50279840((D)-2,2-difluoro-2-deoxy-myo-inositol 1,4,5-tripho...)
Affinity DataKi:  2.60E+4nM. Assay description: Compound was evaluated for binding affinity towards Inositol-1,4,5-trisphosphate 5-phosphatase
In DepthDetails Article
TargetInositol 1,4,5-trisphosphate receptor type 1/2/3(Homo sapiens (Human))
TBA
Curated by ChEMBL
LigandPNGBDBM50279840((D)-2,2-difluoro-2-deoxy-myo-inositol 1,4,5-tripho...)
Affinity DataEC50:  410nM. Assay description: Compound was evaluated for its effective dose to inhibit the calcium release as a measure of affinity for Inositol 1,4,5-trisphosphate receptor
In DepthDetails Article
TargetInositol 1,4,5-trisphosphate receptor type 1/2/3(Homo sapiens (Human))
TBA
Curated by ChEMBL
LigandPNGBDBM50279840((D)-2,2-difluoro-2-deoxy-myo-inositol 1,4,5-tripho...)
Affinity DataEC50:  410nM. Assay description: Compound was evaluated for its effective dose to inhibit the calcium release as a measure of affinity for Inositol 1,4,5-trisphosphate receptor
In DepthDetails Article
TargetInositol 1,4,5-trisphosphate receptor type 3(Homo sapiens (Human))
TBA
Curated by ChEMBL
LigandPNGBDBM50279840((D)-2,2-difluoro-2-deoxy-myo-inositol 1,4,5-tripho...)
Affinity DataEC50:  210nM. Assay description: Compound was evaluated for its effective dose to inhibit the calcium release as a measure of affinity for Ins(1,4,5)P3 receptor
In DepthDetails Article