BDBM50280419 2-[3-(1-Methyl-1H-imidazole-2-sulfonyl)-propylsulfanyl]-4,5-diphenyl-1H-imidazole::CHEMBL127304
SMILES Cn1ccnc1S(=O)(=O)CCCSc1nc(c([nH]1)-c1ccccc1)-c1ccccc1
InChI Key InChIKey=QQSXANKLBSHBIH-UHFFFAOYSA-N
Data  2 IC50
  Tab Delimited (TSV)   2D SDfile   Computed 3D by Vconf -m prep SDfile
Find this compound or compounds like it in BindingDB:
Activity Spreadsheet -- Enzyme Inhibition Constant Data from BindingDB
Found 2 hits for monomerid = 50280419
TargetSterol O-acyltransferase 1(Rattus norvegicus)
TBA
Curated by ChEMBL
LigandPNGBDBM50280419(2-[3-(1-Methyl-1H-imidazole-2-sulfonyl)-propylsulf...)
Affinity DataIC50:  11nM. Assay description: Concentration required for the inhibition of cholesterol O-acyl transferase (ACAT) from rat liver
In DepthDetails Article
TargetAcyl-CoA:cholesterol acyltransferase(Oryctolagus cuniculus)
TBA
Curated by ChEMBL
LigandPNGBDBM50280419(2-[3-(1-Methyl-1H-imidazole-2-sulfonyl)-propylsulf...)
Affinity DataIC50:  8.00E+3nM. Assay description: Concentration required for the inhibition of cholesterol O-acyl transferase (ACAT) from cholesterol fed rabbit liver
In DepthDetails Article