BDBM50281346 (3R,4S,5R)-3,4-Dihydroxy-5-(oxalyl-amino)-cyclohex-1-enecarboxylic acid::CHEMBL99150
SMILES O[C@@H]1C=C(C[C@@H](NC(=O)C(O)=O)[C@@H]1O)C(O)=O
InChI Key InChIKey=LETCNVRBOOJPCT-PBXRRBTRSA-N
Data  1 IC50
  Tab Delimited (TSV)   2D SDfile   Computed 3D by Vconf -m prep SDfile
Find this compound or compounds like it in BindingDB:
Activity Spreadsheet -- Enzyme Inhibition Constant Data from BindingDB
Found 1 hit for monomerid = 50281346
Target3-phosphoshikimate 1-carboxyvinyltransferase(Escherichia coli (strain K12))
TBA
Curated by ChEMBL
LigandPNGBDBM50281346((3R,4S,5R)-3,4-Dihydroxy-5-(oxalyl-amino)-cyclohex...)
Affinity DataIC50: >1.00E+7nM. Assay description: The compound was tested for the inhibition of E. coli 5-enolpyruvyl-shikimate-3-phosphate synthase (EPSP).
In DepthDetails Article