BDBM50281906 2-[(E)-2-(9,9a-Dihydro-4aH-xanthen-9-yl)-vinyl]-1-methyl-piperidine::CHEMBL25334
SMILES CN1CCCCC1\C=C\C1C2C=CC=CC2Oc2ccccc12
InChI Key InChIKey=ICGBAPUYWRSKRD-BUHFOSPRSA-N
Data  2 Kd
  Tab Delimited (TSV)   2D SDfile   Computed 3D by Vconf -m prep SDfile
Find this compound or compounds like it in BindingDB:
Activity Spreadsheet -- Enzyme Inhibition Constant Data from BindingDB
Found 2 hits for monomerid = 50281906
TargetMuscarinic acetylcholine receptor M1(Homo sapiens (Human))
TBA
Curated by ChEMBL
LigandPNGBDBM50281906(2-[(E)-2-(9,9a-Dihydro-4aH-xanthen-9-yl)-vinyl]-1-...)
Affinity DataKd:  3.40nM. Assay description: Displacement of [3H]-QNB from muscarinic receptor 1 expressed in CHO-K1 cells
In DepthDetails Article
LigandPNGBDBM50281906(2-[(E)-2-(9,9a-Dihydro-4aH-xanthen-9-yl)-vinyl]-1-...)
Affinity DataKd:  25nM. Assay description: Displacement of [3H]-QNB from rat brain stem muscarinic receptor 2 (M2)
In DepthDetails Article