BDBM50283074 CHEMBL413681::Cyclic-Ac-Asp-Ile-Val-Thr-Met-Glu-Tyr-Arg-NH2
SMILES CC[C@H](C)[C@H]1NC(=O)[C@@H](CC(=O)NC(N)=NCCC[C@H](NC(=O)[C@H](Cc2ccc(O)cc2)NC(=O)[C@@H](CCC(O)=O)NC(=O)[C@H](CCSC)NC(=O)[C@H](NC(=O)[C@@H](NC1=O)C(C)C)[C@@H](C)O)C(N)=O)C(C)=O
InChI Key InChIKey=AYDSNKLGLQHRHM-OPSPWEOPSA-N
Data  2 KI
  Tab Delimited (TSV)   2D SDfile   Computed 3D by Vconf -m prep SDfile
Find this compound or compounds like it in BindingDB:
Activity Spreadsheet -- Enzyme Inhibition Constant Data from BindingDB
Found 2 hits for monomerid = 50283074
TargetChymotrypsinogen A(Bos taurus (bovine))
TBA
Curated by ChEMBL
LigandPNGBDBM50283074(CHEMBL413681 | Cyclic-Ac-Asp-Ile-Val-Thr-Met-Glu-T...)
Affinity DataKi:  191nM. Assay description: Compound was tested for the inhibition of chymotrypsin at 120 nM
In DepthDetails Article
TargetChymotrypsinogen A(Bos taurus (bovine))
TBA
Curated by ChEMBL
LigandPNGBDBM50283074(CHEMBL413681 | Cyclic-Ac-Asp-Ile-Val-Thr-Met-Glu-T...)
Affinity DataKi:  203nM. Assay description: Compound was tested for the inhibition of chymotrypsin at 69 nM
In DepthDetails Article