BDBM50283894 3-methoxy-2-methyl-4-methylamino-(2R,3S,4S,6S)-29-oxa-1,7,17-triazaoctacyclo[12.12.2.12,6.07,28.08,13.015,19.020,27.021,26]nonacosa-8(13),9,11,14,19,21(26),22,24,27-nonaene-16,18-dione::CHEMBL337026
SMILES CN[C@H]1C[C@@H]2O[C@](C)([C@H]1OC)n1c3ccccc3c3c4C(=O)NC(=O)c4c4c5ccccc5n2c4c13
InChI Key InChIKey=POTTVLREWUNNRO-XCXUBNKDSA-N
Data  2 IC50
  Tab Delimited (TSV)   2D SDfile   Computed 3D by Vconf -m prep SDfile
Find this compound or compounds like it in BindingDB:
Activity Spreadsheet -- Enzyme Inhibition Constant Data from BindingDB
Found 2 hits for monomerid = 50283894
TargetEpidermal growth factor receptor(Homo sapiens (Human))
TBA
Curated by ChEMBL
LigandPNGBDBM50283894(3-methoxy-2-methyl-4-methylamino-(2R,3S,4S,6S)-29-...)
Affinity DataIC50:  200nM. Assay description: Inhibitory activity against protein tyrosine kinase of Epidermal growth factor receptor was determined
In DepthDetails Article
TargetProto-oncogene tyrosine-protein kinase Src(Homo sapiens (Human))
TBA
Curated by ChEMBL
LigandPNGBDBM50283894(3-methoxy-2-methyl-4-methylamino-(2R,3S,4S,6S)-29-...)
Affinity DataIC50:  800nM. Assay description: Inhibition of Src tyrosine kinase
In DepthDetails Article