BDBM50284125 7-[3-(4-Isopropylcarbamoyl-3-methoxy-2-propyl-phenoxy)-propoxy]-8-propyl-chroman-2-carboxylic acid::CHEMBL422388::SC-52073
SMILES CCCc1c(OCCCOc2ccc3CCC(Oc3c2CCC)C(O)=O)ccc(C(=O)NC(C)C)c1OC
InChI Key InChIKey=LCOBFNPHFDALDJ-UHFFFAOYSA-N
Data  1 IC50
  Tab Delimited (TSV)   2D SDfile   Computed 3D by Vconf -m prep SDfile
Find this compound or compounds like it in BindingDB:
Activity Spreadsheet -- Enzyme Inhibition Constant Data from BindingDB
Found 1 hit for monomerid = 50284125
TargetLeukotriene B4 receptor 1(Homo sapiens (Human))
TBA
Curated by ChEMBL
LigandPNGBDBM50284125(7-[3-(4-Isopropylcarbamoyl-3-methoxy-2-propyl-phen...)
Affinity DataIC50:  0.100nM. Assay description: Inhibitory activity against leukotriene B4 receptor
In DepthDetails Article