BDBM50285057 CHEMBL61876::tert-butyl 3-(3-cyclopentyloxy-4-methoxyphenyl)-4-methoxymethyl-(3R,4S)-tetrahydro-1H-1-pyrrolecarboxylate
SMILES COC[C@@H]1CN(C[C@H]1c1ccc(OC)c(OC2CCCC2)c1)C(=O)OC(C)(C)C
InChI Key InChIKey=JOHBFPYLJYNSHP-HKUYNNGSSA-N
Data  1 KI
  Tab Delimited (TSV)   2D SDfile   Computed 3D by Vconf -m prep SDfile
Find this compound or compounds like it in BindingDB:
Activity Spreadsheet -- Enzyme Inhibition Constant Data from BindingDB
Found 1 hit for monomerid = 50285057
TargetcAMP-specific 3',5'-cyclic phosphodiesterase 4B(Homo sapiens (Human))
TBA
Curated by ChEMBL
LigandPNGBDBM50285057(CHEMBL61876 | tert-butyl 3-(3-cyclopentyloxy-4-met...)
Affinity DataKi:  80nM. Assay description: Ability to inhibit the catalytic activity of human Phosphodiesterase 4B (PDE IVB)
In DepthDetails Article