BDBM50285493 10,12-Dimethyl-tetradecanoic acid {3-(2-carbamoyl-1-hydroxy-ethyl)-11,20,25-trihydroxy-15-(1-hydroxy-ethyl)-6-[1-hydroxy-2-(4-hydroxy-phenyl)-ethyl]-2,5,8,14,17,23-hexaoxo-1,4,7,13,16,22-hexaaza-tricyclo[22.3.0.0*9,13*]heptacos-18-yl}-amide::CHEMBL437438::L-692289
SMILES CCC(C)CC(C)CCCCCCCCC(=O)N[C@H]1C[C@@H](O)CNC(=O)[C@@H]2[C@@H](O)CCN2C(=O)[C@@H](NC(=O)[C@@H](NC(=O)[C@@H]2C[C@@H](O)CN2C(=O)[C@@H](NC1=O)[C@@H](C)O)[C@H](O)Cc1ccc(O)cc1)[C@H](O)CC(N)=O
InChI Key InChIKey=ZDGSWUBIMMFISL-IQTRWBIESA-N
Data  1 IC50
  Tab Delimited (TSV)   2D SDfile   Computed 3D by Vconf -m prep SDfile
Find this compound or compounds like it in BindingDB:
Activity Spreadsheet -- Enzyme Inhibition Constant Data from BindingDB
Found 1 hit for monomerid = 50285493
Target1,3-beta-glucan synthase(Candida albicans (Yeast))
TBA
Curated by ChEMBL
LigandPNGBDBM50285493(10,12-Dimethyl-tetradecanoic acid {3-(2-carbamoyl-...)
Affinity DataIC50:  70nM. Assay description: Tested for inhibition of Beta-1,3-glucan synthase using a crude membrane of Candida albicans (MY 1208).
In DepthDetails Article