BDBM50286578 CHEMBL4170617
SMILES CC(C)CCN(CCCCCCC(=O)NO)c1ncc(s1)C(=O)NCCCn1ccnc1
InChI Key InChIKey=RBVSKBDEAXWXGR-UHFFFAOYSA-N
Data  7 IC50
  Tab Delimited (TSV)   2D SDfile   Computed 3D by Vconf -m prep SDfile
Find this compound or compounds like it in BindingDB:
Activity Spreadsheet -- Enzyme Inhibition Constant Data from BindingDB
Found 7 hits for monomerid = 50286578
TargetNuclear receptor corepressor 1(Homo sapiens (Human))
Second Military Medical University
Curated by ChEMBL
LigandPNGBDBM50286578(CHEMBL4170617)
Affinity DataIC50:  0.670nM. Assay description: Inhibition of human recombinant HDAC3/GST-tagged NCOR1 DAD (397 to 503 residues) expressed in baculovirus expression system after 30 mins by fluoresc...
In DepthDetails ArticlePubMed
TargetHistone deacetylase 4(Homo sapiens (Human))
Second Military Medical University
Curated by ChEMBL
LigandPNGBDBM50286578(CHEMBL4170617)
Affinity DataIC50:  1.20E+4nM. Assay description: Inhibition of recombinant human N-terminal GST-tagged HDAC4 (612 to end residues) expressed in baculovirus infected Sf9 insect cells after 30 mins by...
In DepthDetails ArticlePubMed
TargetNicotinamide phosphoribosyltransferase(Homo sapiens (Human))
Second Military Medical University
Curated by ChEMBL
LigandPNGBDBM50286578(CHEMBL4170617)
Affinity DataIC50:  15nM. Assay description: Inhibition of NAMPT (unknown origin) using NAM as substrate incubated for 5 mins followed by substrate addition measured after 15 mins by fluorometri...
In DepthDetails ArticlePubMed
TargetHistone deacetylase 6(Homo sapiens (Human))
Second Military Medical University
Curated by ChEMBL
LigandPNGBDBM50286578(CHEMBL4170617)
Affinity DataIC50:  0.640nM. Assay description: Inhibition of recombinant human full length C-terminal flag-tagged HDAC6 expressed in baculovirus infected Sf9 insect cells after 30 mins by fluoresc...
In DepthDetails ArticlePubMed
TargetHistone deacetylase 2(Homo sapiens (Human))
Second Military Medical University
Curated by ChEMBL
LigandPNGBDBM50286578(CHEMBL4170617)
Affinity DataIC50:  6.80nM. Assay description: Inhibition of HDAC2 (unknown origin)
In DepthDetails ArticlePubMed
TargetHistone deacetylase 1(Homo sapiens (Human))
Second Military Medical University
Curated by ChEMBL
LigandPNGBDBM50286578(CHEMBL4170617)
Affinity DataIC50:  2nM. Assay description: Inhibition of recombinant full length human C-terminal His/flag-tagged HDAC1 expressed in baculovirus infected Sf9 insect cells after 30 mins by fluo...
In DepthDetails ArticlePubMed
TargetHistone deacetylase 8(Homo sapiens (Human))
Second Military Medical University
Curated by ChEMBL
LigandPNGBDBM50286578(CHEMBL4170617)
Affinity DataIC50:  204nM. Assay description: Inhibition of recombinant human full length C-terminal His-tagged HDAC8 expressed in baculovirus infected Sf9 insect cells after 30 mins by fluoresce...
In DepthDetails ArticlePubMed