BDBM50287317 CHEMBL3349448::CHEMBL37469::[3-[3-tert-Butylsulfanyl-1-(4-chloro-benzyl)-5-isopropyl-1H-indol-2-yl]-2,2-dimethyl-prop-(E)-ylideneaminooxy]-acetic acid
SMILES CC(C)c1ccc2n(Cc3ccc(Cl)cc3)c(CC(C)(C)\C=N\OCC(O)=O)c(SC(C)(C)C)c2c1
InChI Key InChIKey=YMFWUDCVNFMAQW-UHFFFAOYSA-N
Data  2 IC50
  Tab Delimited (TSV)   2D SDfile   Computed 3D by Vconf -m prep SDfile
Find this compound or compounds like it in BindingDB:
Activity Spreadsheet -- Enzyme Inhibition Constant Data from BindingDB
Found 2 hits for monomerid = 50287317
LigandPNGBDBM50287317(CHEMBL3349448 | CHEMBL37469 | [3-[3-tert-Butylsulf...)
Affinity DataIC50:  100nM. Assay description: Human whole blood was stimulated with calcium ionophore (A23187) and LTB 4 measured by enzyme immunoassay
In DepthDetails Article
LigandPNGBDBM50287317(CHEMBL3349448 | CHEMBL37469 | [3-[3-tert-Butylsulf...)
Affinity DataIC50:  680nM. Assay description: Human whole blood was stimulated with calcium ionophore (A23187) and LTB 4 measured by enzyme immunoassay
In DepthDetails Article