BDBM50287555 CHEMBL4174695
SMILES Cc1noc(CNC(=O)c2ccc(C)c(c2)S(=O)(=O)Nc2ccc(Cl)cc2)n1
InChI Key InChIKey=DKFKIHZPQKGGTE-UHFFFAOYSA-N
Data  1 KI  6 IC50
  Tab Delimited (TSV)   2D SDfile   Computed 3D by Vconf -m prep SDfile
Find this compound or compounds like it in BindingDB:
Activity Spreadsheet -- Enzyme Inhibition Constant Data from BindingDB
Found 7 hits for monomerid = 50287555
TargetPotassium voltage-gated channel subfamily H member 2(Homo sapiens (Human))
Pfizer
Curated by ChEMBL
LigandPNGBDBM50287555(CHEMBL4174695)
Affinity DataKi: >4.00E+4nM. Assay description: Displacement of fluorescent-labelled dofetilide from human ERG expressed in HEK293 cell membrane homogenates
In DepthDetails ArticlePubMed
TargetATP-sensitive inward rectifier potassium channel 1(Homo sapiens (Human))
Pfizer
Curated by ChEMBL
LigandPNGBDBM50287555(CHEMBL4174695)
Affinity DataIC50:  777nM. Assay description: Inhibition of human ROMK1 expressed in HEK293 cells after 20 mins by Thallos-AM dye based fluorescence assay
In DepthDetails ArticlePubMed
TargetATP-sensitive inward rectifier potassium channel 1(Homo sapiens (Human))
Pfizer
Curated by ChEMBL
LigandPNGBDBM50287555(CHEMBL4174695)
Affinity DataIC50:  62nM. Assay description: Inhibition of human ROMK1 expressed in HEK293 cells at -75 mV holding potential by whole cell patch clamp method
In DepthDetails ArticlePubMed
TargetATP-sensitive inward rectifier potassium channel 1(Rattus norvegicus (Rat))
Pfizer
Curated by ChEMBL
LigandPNGBDBM50287555(CHEMBL4174695)
Affinity DataIC50: >3.00E+4nM. Assay description: Inhibition of rat ROMK1 expressed in HEK293 cells after 20 mins by Thallos-AM dye based fluorescence assay
In DepthDetails ArticlePubMed
TargetATP-sensitive inward rectifier potassium channel 1(Homo sapiens (Human))
Pfizer
Curated by ChEMBL
LigandPNGBDBM50287555(CHEMBL4174695)
Affinity DataIC50:  794nM. Assay description: Inhibition of human ROMK1 expressed in HEK293 cells after 20 mins by Thallos-AM dye based fluorescence assay
In DepthDetails ArticlePubMed
TargetATP-sensitive inward rectifier potassium channel 1(Homo sapiens (Human))
Pfizer
Curated by ChEMBL
LigandPNGBDBM50287555(CHEMBL4174695)
Affinity DataIC50:  85nM. Assay description: Inhibition of human ROMK2 expressed in HEK293 cells after 20 mins by Thallos-AM dye based fluorescence assay
In DepthDetails ArticlePubMed
TargetATP-sensitive inward rectifier potassium channel 1(Homo sapiens (Human))
Pfizer
Curated by ChEMBL
LigandPNGBDBM50287555(CHEMBL4174695)
Affinity DataIC50:  85nM. Assay description: Inhibition of human ROMK2 expressed in HEK293 cells after 20 mins by Thallos-AM dye based fluorescence assay
In DepthDetails ArticlePubMed