BDBM50290705 (3-{2-[4-(1H-Benzoimidazole-2-carbonyl)-piperidin-1-yl]-ethyl}-3-phenyl-pyrrolidin-1-yl)-(3,4,5-trimethoxy-phenyl)-methanone::CHEMBL330499
SMILES COc1cc(cc(OC)c1OC)C(=O)N1CCC(CCN2CCC(CC2)C(=O)c2nc3ccccc3[nH]2)(C1)c1ccccc1
InChI Key InChIKey=XHIAYAAKBSHSOX-UHFFFAOYSA-N
Data  4 IC50
  Tab Delimited (TSV)   2D SDfile   Computed 3D by Vconf -m prep SDfile
Find this compound or compounds like it in BindingDB:
Activity Spreadsheet -- Enzyme Inhibition Constant Data from BindingDB
Found 4 hits for monomerid = 50290705
TargetSubstance-P receptor(GUINEA PIG)
TBA
Curated by ChEMBL
LigandPNGBDBM50290705((3-{2-[4-(1H-Benzoimidazole-2-carbonyl)-piperidin-...)
Affinity DataIC50:  36nM. Assay description: Antagonism of the guinea pig tachykinin NK1 receptor
In DepthDetails Article
TargetHistamine H1 receptor(Homo sapiens (Human))
TBA
Curated by ChEMBL
LigandPNGBDBM50290705((3-{2-[4-(1H-Benzoimidazole-2-carbonyl)-piperidin-...)
Affinity DataIC50:  500nM. Assay description: Antagonism of the human histamine H1 receptor
In DepthDetails Article
TargetHistamine H1 receptor(Homo sapiens (Human))
TBA
Curated by ChEMBL
LigandPNGBDBM50290705((3-{2-[4-(1H-Benzoimidazole-2-carbonyl)-piperidin-...)
Affinity DataIC50:  6.30nM. Assay description: Antagonistic activity against histamine H1 receptor
In DepthDetails Article
TargetSubstance-P receptor(GUINEA PIG)
TBA
Curated by ChEMBL
LigandPNGBDBM50290705((3-{2-[4-(1H-Benzoimidazole-2-carbonyl)-piperidin-...)
Affinity DataIC50:  7.40nM. Assay description: Antagonistic activity against Tachykinin receptor 1
In DepthDetails Article