BDBM50290729 CHEMBL327888::[3-(3,4-Dimethoxy-phenyl)-3-(2-{4-[1-(2-ethoxy-ethyl)-1H-benzoimidazole-2-carbonyl]-piperidin-1-yl}-ethyl)-pyrrolidin-1-yl]-(3,4,5-trimethoxy-phenyl)-methanone
SMILES CCOCCn1c(nc2ccccc12)C(=O)C1CCN(CCC2(CCN(C2)C(=O)c2cc(OC)c(OC)c(OC)c2)c2ccc(OC)c(OC)c2)CC1
InChI Key InChIKey=OEJHRMYSNOPXGZ-UHFFFAOYSA-N
Data  2 IC50
  Tab Delimited (TSV)   2D SDfile   Computed 3D by Vconf -m prep SDfile
Find this compound or compounds like it in BindingDB:
Activity Spreadsheet -- Enzyme Inhibition Constant Data from BindingDB
Found 2 hits for monomerid = 50290729
TargetHistamine H1 receptor(Homo sapiens (Human))
TBA
Curated by ChEMBL
LigandPNGBDBM50290729(CHEMBL327888 | [3-(3,4-Dimethoxy-phenyl)-3-(2-{4-[...)
Affinity DataIC50:  6.20nM. Assay description: Antagonistic activity against histamine H1 receptor
In DepthDetails Article
TargetSubstance-P receptor(GUINEA PIG)
TBA
Curated by ChEMBL
LigandPNGBDBM50290729(CHEMBL327888 | [3-(3,4-Dimethoxy-phenyl)-3-(2-{4-[...)
Affinity DataIC50:  7.40nM. Assay description: Antagonistic activity against Tachykinin receptor 1
In DepthDetails Article