BDBM50291318 3-[3-Allyl-4-(3-hydroxy-1-aza-bicyclo[2.2.2]oct-3-ylethynyl)-phenyl]-propionitrile::CHEMBL158304
SMILES OC1(CN2CCC1CC2)C#Cc1ccc(CCC#N)cc1CC=C
InChI Key InChIKey=DVOTYBFGPKGZAC-UHFFFAOYSA-N
Data  1 KI
  Tab Delimited (TSV)   2D SDfile   Computed 3D by Vconf -m prep SDfile
Find this compound or compounds like it in BindingDB:
Activity Spreadsheet -- Enzyme Inhibition Constant Data from BindingDB
Found 1 hit for monomerid = 50291318
TargetSqualene synthase(Rattus norvegicus)
TBA
Curated by ChEMBL
LigandPNGBDBM50291318(3-[3-Allyl-4-(3-hydroxy-1-aza-bicyclo[2.2.2]oct-3-...)
Affinity DataKi: >250nM. Assay description: Tested for its inhibitory activity against rat microsomal quinuclidine squalene synthase (SQS)
In DepthDetails Article