BDBM50291347 CHEMBL164330::Piperidin-1-yl-[3-(3,4,10,10a-tetrahydro-1H-9-oxa-2,4a-diaza-phenanthren-2-ylmethyl)-phenyl]-methanone
SMILES O=C(N1CCCCC1)c1cccc(CN2CCN3C(COc4ccccc34)C2)c1
InChI Key InChIKey=MLQBZMDETHZBJW-UHFFFAOYSA-N
Data  3 KI
  Tab Delimited (TSV)   2D SDfile   Computed 3D by Vconf -m prep SDfile
Find this compound or compounds like it in BindingDB:
Activity Spreadsheet -- Enzyme Inhibition Constant Data from BindingDB
Found 3 hits for monomerid = 50291347
Target5-hydroxytryptamine receptor 1A(Homo sapiens (Human))
TBA
Curated by ChEMBL
LigandPNGBDBM50291347(CHEMBL164330 | Piperidin-1-yl-[3-(3,4,10,10a-tetra...)
Affinity DataKi:  12nM. Assay description: Compound was measured in vivo for its binding affinity at 5-hydroxytryptamine 1A receptor using [3H]-8-OH-DPAT as radioligand
In DepthDetails Article
TargetAlpha-1A/Alpha-1B/Alpha-1D adrenergic receptor(Homo sapiens (Human))
TBA
Curated by ChEMBL
LigandPNGBDBM50291347(CHEMBL164330 | Piperidin-1-yl-[3-(3,4,10,10a-tetra...)
Affinity DataKi:  200nM. Assay description: Compound was measured in vivo for its binding affinity at Alpha-1 adrenergic receptor using [3H]prazosin as radioligand.
In DepthDetails Article
TargetD(2) dopamine receptor(Homo sapiens (Human))
TBA
Curated by ChEMBL
LigandPNGBDBM50291347(CHEMBL164330 | Piperidin-1-yl-[3-(3,4,10,10a-tetra...)
Affinity DataKi: >1.00E+3nM. Assay description: Compound was measured in vivo for its binding affinity at Dopamine receptor D2 using [3H]-spiperone as radioligand.
In DepthDetails Article