BDBM50292585 CHEMBL4161382
SMILES CO[C@H]1O[C@H](CS(=O)(=O)CCCN)[C@@H](O)[C@H](O)[C@H]1O
InChI Key InChIKey=SDZICGGRAFKAKY-SPFKKGSWSA-N
Data  3 KI
  Tab Delimited (TSV)   2D SDfile   Computed 3D by Vconf -m prep SDfile
Find this compound or compounds like it in BindingDB:
Activity Spreadsheet -- Enzyme Inhibition Constant Data from BindingDB
Found 3 hits for monomerid = 50292585
TargetBifunctional glucose-6-phosphate 1-dehydrogenase/6-phosphogluconolactonase(Plasmodium falciparum (isolate 3D7))
University Of Barcelona
Curated by ChEMBL
LigandPNGBDBM50292585(CHEMBL4161382)
Affinity DataKi:  3.44E+4nM. Assay description: Inhibition of Plasmodium falciparum G6PD-6PGL using G6P as substrate in presence of NADP+ by spectrofluorimetric analysis
In DepthDetails ArticlePubMed
TargetGlucose-6-phosphate 1-dehydrogenase(Homo sapiens (Human))
Stanford University
Curated by ChEMBL
LigandPNGBDBM50292585(CHEMBL4161382)
Affinity DataKi:  3.54E+4nM. Assay description: Binding affinity to human G6PD
In DepthDetails PubMed
TargetGlucose-6-phosphate 1-dehydrogenase(Homo sapiens (Human))
Stanford University
Curated by ChEMBL
LigandPNGBDBM50292585(CHEMBL4161382)
Affinity DataKi:  3.54E+4nM. Assay description: Inhibition of VLA-4 expressed in Jurkat cell line, in a cell-based adhesion assay.
In DepthDetails ArticlePubMed