BDBM50292757 17beta-Hydroxy-11beta-[4-(6-hydroxy-N-methylhexylamino)-phenyl]-17alpha-(1-propinyl)-estra-4,9-dien-3-one::CHEMBL455411
SMILES CC#C[C@]1(O)CC[C@H]2[C@@H]3CCC4=CC(=O)CCC4=C3[C@H](C[C@]12C)c1ccc(cc1)N(C)CCCCCCO
InChI Key InChIKey=SDRSOIXGIVEZMG-FMHBTXFXSA-N
Data  2 IC50
  Tab Delimited (TSV)   2D SDfile   Computed 3D by Vconf -m prep SDfile
Find this compound or compounds like it in BindingDB:
Activity Spreadsheet -- Enzyme Inhibition Constant Data from BindingDB
Found 2 hits for monomerid = 50292757
TargetProgesterone receptor(Homo sapiens (Human))
University Of Graz
Curated by ChEMBL
LigandPNGBDBM50292757(17beta-Hydroxy-11beta-[4-(6-hydroxy-N-methylhexyla...)
Affinity DataIC50:  0.0600nM. Assay description: Antagonist activity at progesterone receptor in human T47D cells assessed as inhibition of progesterone-induced alkaline phosphatase activity after 4...
In DepthDetails ArticlePubMed
TargetProgesterone receptor(Homo sapiens (Human))
University Of Graz
Curated by ChEMBL
LigandPNGBDBM50292757(17beta-Hydroxy-11beta-[4-(6-hydroxy-N-methylhexyla...)
Affinity DataIC50:  0.0710nM. Assay description: Antagonist activity at progesterone receptor in human T47D-C124 cells transfected with luciferase gene linked to MMTV promoter assessed as inhibition...
In DepthDetails ArticlePubMed