BDBM50292860 1-Phosphono-4-[3-(4-chlorophenoxy)phenyl]butylsulfonic Acid Tripotassium Salt::CHEMBL473741
SMILES [O-]P([O-])(=O)C(CCCc1cccc(Oc2ccc(Cl)cc2)c1)S([O-])(=O)=O
InChI Key InChIKey=WFRSZISILHXWHG-UHFFFAOYSA-K
Data  2 IC50
  Tab Delimited (TSV)   2D SDfile   Computed 3D by Vconf -m prep SDfile
Find this compound or compounds like it in BindingDB:
Activity Spreadsheet -- Enzyme Inhibition Constant Data from BindingDB
Found 2 hits for monomerid = 50292860
TargetSqualene synthase(Homo sapiens (Human))
University Of Illinois At Urbana-Champaign
Curated by ChEMBL
LigandPNGBDBM50292860(1-Phosphono-4-[3-(4-chlorophenoxy)phenyl]butylsulf...)
Affinity DataIC50:  20nM. Assay description: Inhibition of human recombinant squalene synthase expressed in Escherichia coli BL21 (DE3) cells assessed as formation of 1,10-dioic acid metabolite ...
In DepthDetails ArticlePubMed
Target4,4'-diapophytoene synthase(Staphylococcus aureus)
University Of Illinois At Urbana-Champaign
Curated by ChEMBL
LigandPNGBDBM50292860(1-Phosphono-4-[3-(4-chlorophenoxy)phenyl]butylsulf...)
Affinity DataIC50:  2.50E+3nM. Assay description: Inhibition of Staphylococcus aureus dehydrosqualene synthase expressed in Escherichia coli BL21 (DE3) cells by continuous spectrophotometric assay
In DepthDetails ArticlePubMed