BDBM50294560 (2S,4R)-4-(((2S,3S,4R,5R)-5-(6-amino-9H-purin-9-yl)-3,4-dihydroxytetrahydrofuran-2-yl)methylthio)piperidine-2-carboxylic acid::CHEMBL551787
SMILES Nc1ncnc2n(cnc12)[C@@H]1O[C@H](CS[C@@H]2CCN[C@@H](C2)C(O)=O)[C@@H](O)[C@H]1O
InChI Key InChIKey=PPAKVYRRHNXOLG-CYZRSLADSA-N
Data  2 IC50
  Tab Delimited (TSV)   2D SDfile   Computed 3D by Vconf -m prep SDfile
Find this compound or compounds like it in BindingDB:
Activity Spreadsheet -- Enzyme Inhibition Constant Data from BindingDB
Found 2 hits for monomerid = 50294560
TargetDNA (cytosine-5)-methyltransferase 3B(Homo sapiens (Human))
Methylgene
Curated by ChEMBL
LigandPNGBDBM50294560((2S,4R)-4-(((2S,3S,4R,5R)-5-(6-amino-9H-purin-9-yl...)
Affinity DataIC50:  3.90E+4nM. Assay description: Inhibition of human recombinant DNMT3b2
In DepthDetails ArticlePubMed
TargetDNA (cytosine-5)-methyltransferase 1(Homo sapiens (Human))
Methylgene
Curated by ChEMBL
LigandPNGBDBM50294560((2S,4R)-4-(((2S,3S,4R,5R)-5-(6-amino-9H-purin-9-yl...)
Affinity DataIC50: >1.00E+5nM. Assay description: Inhibition of human recombinant DNMT1
In DepthDetails ArticlePubMed