BDBM50294696 4-((2-chlorobenzyl)(1-(2-methylthiazol-4-yl)ethyl)amino)-2-chlorobenzonitrile::CHEMBL551782
SMILES CC(N(Cc1ccccc1Cl)c1ccc(C#N)c(Cl)c1)c1csc(C)n1
InChI Key InChIKey=YXFZNSZDZKRXGZ-UHFFFAOYSA-N
Data  2 IC50  1 EC50
  Tab Delimited (TSV)   2D SDfile   Computed 3D by Vconf -m prep SDfile
Find this compound or compounds like it in BindingDB:
Activity Spreadsheet -- Enzyme Inhibition Constant Data from BindingDB
Found 3 hits for monomerid = 50294696
TargetProgesterone receptor(Homo sapiens (Human))
Glaxosmithkline
Curated by ChEMBL
LigandPNGBDBM50294696(4-((2-chlorobenzyl)(1-(2-methylthiazol-4-yl)ethyl)...)
Affinity DataEC50:  380nM. Assay description: Agonist activity at progesterone receptor in human T47D cells by alkaline phosphatase release based reporter gene assay
In DepthDetails ArticlePubMed
TargetProgesterone receptor(Homo sapiens (Human))
Glaxosmithkline
Curated by ChEMBL
LigandPNGBDBM50294696(4-((2-chlorobenzyl)(1-(2-methylthiazol-4-yl)ethyl)...)
Affinity DataIC50:  13nM. Assay description: Binding affinity to progesterone receptor ligand binding domain by fluorimetric assay
In DepthDetails ArticlePubMed
TargetCytochrome P450 2C19(Homo sapiens (Human))
Glaxosmithkline
Curated by ChEMBL
LigandPNGBDBM50294696(4-((2-chlorobenzyl)(1-(2-methylthiazol-4-yl)ethyl)...)
Affinity DataIC50:  67nM. Assay description: Inhibition of CYP2C19
In DepthDetails ArticlePubMed