BDBM50295587 5-Chloro-thiophene-2-carboxylic acid ((3S,4S)-1-{[2-fluoro-4-(2-oxo-2H-pyridin-1-yl)-phenylcarbamoyl]-methyl}-4-hydroxy-pyrrolidin-3-yl)-amide::5-chloro-N-((3S,4S)-1-(2-(2-fluoro-4-(2-oxopyridin-1(2H)-yl)phenylamino)-2-oxoethyl)-4-hydroxypyrrolidin-3-yl)thiophene-2-carboxamide::CHEMBL561318
SMILES O[C@H]1CN(CC(=O)Nc2ccc(cc2F)-n2ccccc2=O)C[C@@H]1NC(=O)c1ccc(Cl)s1
InChI Key InChIKey=ARAVOODWJJJNBY-IRXDYDNUSA-N
Data  1 KI
PDB links: 1 PDB ID matches this monomer.
  Tab Delimited (TSV)   2D SDfile   Computed 3D by Vconf -m prep SDfile
Find this compound or compounds like it in BindingDB:
Activity Spreadsheet -- Enzyme Inhibition Constant Data from BindingDB
Found 1 hit for monomerid = 50295587
TargetCoagulation factor X(Homo sapiens (Human))
F. Hoffmann-La Roche
Curated by ChEMBL
LigandPNGBDBM50295587(5-Chloro-thiophene-2-carboxylic acid ((3S,4S)-1-{[...)
Affinity DataKi:  10nM. Assay description: Binding affinity to factor 10a