BDBM50297253 7-(3-Chloro-benzyloxy)-2-(3,4-dihydroxy-phenyl)-3,5-dihydroxy-chromen-4-one::CHEMBL551130
SMILES Oc1ccc(cc1O)-c1oc2cc(OCc3cccc(Cl)c3)cc(O)c2c(=O)c1O
InChI Key InChIKey=BIVPHUOIFUDUSK-UHFFFAOYSA-N
Data  2 IC50
  Tab Delimited (TSV)   2D SDfile   Computed 3D by Vconf -m prep SDfile
Find this compound or compounds like it in BindingDB:
Activity Spreadsheet -- Enzyme Inhibition Constant Data from BindingDB
Found 2 hits for monomerid = 50297253
TargetReplicase polyprotein 1ab(Human SARS coronavirus (SARS-CoV) (Severe acute re...)
Konkuk University
Curated by ChEMBL
LigandPNGBDBM50297253(7-(3-Chloro-benzyloxy)-2-(3,4-dihydroxy-phenyl)-3,...)
Affinity DataIC50:  5.20E+3nM. Assay description: Inhibition of SARS coronavirus helicase assessed as duplex-DNA unwinding by FRET based assay
In DepthDetails ArticlePubMed
TargetReplicase polyprotein 1ab(Human SARS coronavirus (SARS-CoV) (Severe acute re...)
Konkuk University
Curated by ChEMBL
LigandPNGBDBM50297253(7-(3-Chloro-benzyloxy)-2-(3,4-dihydroxy-phenyl)-3,...)
Affinity DataIC50: >5.00E+4nM. Assay description: Inhibition of ATPase activity of SARS coronavirus helicase assessed as phosphate release by malachite green assay
In DepthDetails ArticlePubMed