BDBM50298208 (S)-2-chloro-4-((2-chloro-5-fluorobenzyl)(1-ethyl-5-oxopyrrolidin-3-yl)amino)benzonitrile::CHEMBL552023
SMILES CCN1C[C@H](CC1=O)N(Cc1cc(F)ccc1Cl)c1ccc(C#N)c(Cl)c1
InChI Key InChIKey=LGRUXHHJUNHGRB-KRWDZBQOSA-N
Data  2 IC50  1 EC50
  Tab Delimited (TSV)   2D SDfile   Computed 3D by Vconf -m prep SDfile
Find this compound or compounds like it in BindingDB:
Activity Spreadsheet -- Enzyme Inhibition Constant Data from BindingDB
Found 3 hits for monomerid = 50298208
TargetProgesterone receptor(Homo sapiens (Human))
Glaxosmithkline
Curated by ChEMBL
LigandPNGBDBM50298208((S)-2-chloro-4-((2-chloro-5-fluorobenzyl)(1-ethyl-...)
Affinity DataEC50:  0.300nM. Assay description: Agonist activity at progesterone receptor in human T47D cells assessed as inhibition of progesterone-induced alkaline phosphatase activity
In DepthDetails ArticlePubMed
TargetProgesterone receptor(Homo sapiens (Human))
Glaxosmithkline
Curated by ChEMBL
LigandPNGBDBM50298208((S)-2-chloro-4-((2-chloro-5-fluorobenzyl)(1-ethyl-...)
Affinity DataIC50:  10nM. Assay description: Binding affinity to progesterone receptor
In DepthDetails ArticlePubMed
TargetPotassium voltage-gated channel subfamily H member 2(Homo sapiens (Human))
Glaxosmithkline
Curated by ChEMBL
LigandPNGBDBM50298208((S)-2-chloro-4-((2-chloro-5-fluorobenzyl)(1-ethyl-...)
Affinity DataIC50:  3.10E+3nM. Assay description: Inhibition of human ERG by whole cell patch clamp assay
In DepthDetails ArticlePubMed